Please Note This forum exists for community support for the Mango product family and the Radix IoT Platform. Although Radix IoT employees participate in this forum from time to time, there is no guarantee of a response to anything posted here, nor can Radix IoT, LLC guarantee the accuracy of any information expressed or conveyed. Specific project questions from customers with active support contracts are asked to send requests to support@radixiot.com.

Radix IoT Website Mango 3 Documentation Website Mango 4 Documentation Website

Getting things to build (Eclipse-Neon, Maven, Ubuntu)


  • Hi Folks,

    I have been following the video on how to build under Eclipse but the Maven Install part is stuck.

    After a git pull from the https://github.com/infiniteautomation/ma-core-public.git I have run mvn install and I get ...

    [INFO] Building Mango Assembly Descriptors 3.0.0-SNAPSHOT
    [INFO] ------------------------------------------------------------------------
    [INFO] ------------------------------------------------------------------------
    [INFO] Reactor Summary:
    [INFO]
    [INFO] Mango Parent ....................................... SUCCESS [ 1.934 s]
    [INFO] Mango Assembly Descriptors ......................... FAILURE [ 0.018 s]
    [INFO] Mango Core ......................................... SKIPPED
    [INFO] Mango Modules ...................................... SKIPPED
    [INFO] ------------------------------------------------------------------------
    [INFO] BUILD FAILURE

    Is anyone else able to build from GIT or is this my environment I need to debug ?

    Thanks
    Jon King


  • Looks like a corrupt jar in Maven .... now to the next issue looks like I am missing a library

    Tests in error:
    DateUtilsTest.testPreviousMinutes:43 NoClassDefFound org/joda/time/DateTime
    DateUtilsTest.testPreviousMonths:170 NoClassDefFound org/joda/time/DateTime
    DateUtilsTest.quickTest:24 NoClassDefFound org/joda/time/DateTime
    DateUtilsTest.testPreviousHours:74 NoClassDefFound org/joda/time/DateTime
    DateUtilsTest.testPreviousWeeks:136 NoClassDefFound org/joda/time/DateTime
    DateUtilsTest.testPreviousYears:201 NoClassDefFound org/joda/time/DateTime

    Tests run: 6, Failures: 0, Errors: 6, Skipped: 0

    [INFO] ------------------------------------------------------------------------
    [INFO] Reactor Summary:
    [INFO]
    [INFO] Mango Parent ....................................... SUCCESS [ 0.462 s]
    [INFO] Mango Assembly Descriptors ......................... SUCCESS [ 0.555 s]
    [INFO] Mango Core ......................................... FAILURE [ 1.329 s]
    [INFO] Mango Modules ...................................... SKIPPED
    [INFO] ------------------------------------------------------------------------
    [INFO] BUILD FAILURE